Jump to content

Search the Community

Showing results for tags 'error'.



More search options

  • Search By Tags

    Type tags separated by commas.
  • Search By Author

Content Type


Forums

  • Altair Support Forum
    • Welcome to Altair Support Forum
    • Installation and Licensing
    • Modeling & Visualisation
    • Solvers & Optimization
    • Conceptual design and Industrial design
    • Model-Based Development
    • Manufacturing Simulation
    • CAE Process Automation
  • Academic Partner Alliance Forum
    • APA - Composites
    • APA - CFD & Thermal
    • APA - Vehicle Dynamics
    • APA - Manufacturing
    • APA - Crash and Safety
    • APA - Noise, Vibration and Harshness
    • APA - System Level Design
    • APA - Structural and Fatigue
    • APA - Marine
  • Japanユーザーフォーラム
    • ユーザーフォーラムへようこそ
    • インストールとライセンス
    • モデリング(プリプロセッシング)
    • シミュレーション技術(ソルバー)
    • データ可視化(ポストプロセッシング)
    • モデルベース開発
    • コンセプト設計と工業デザイン
    • 製造シミュレーション
    • CAE プロセスの自動化

Categories

There are no results to display.


Find results in...

Find results that contain...


Date Created

  • Start

    End


Last Updated

  • Start

    End


Filter by number of...

Joined

  • Start

    End


Group


AIM


MSN


Website URL


ICQ


Yahoo


Jabber


Skype


Interests


Location

Found 135 results

  1. savednd

    License Error

    I'm just trying to install HyperWorks 2017.2 student edition, I have followed all the instruction content in the mail I received from Altair University but when i try to run the program, this is the error I read.
  2. Hi, I've been trying to run a CFD simulation using the Hypermesh solver, however, I always get the same error (ERROR: error occurred executing acuPrep) and I don´t know what it means. Can anyone tell me why this happens and how to fix it? Thanks.
  3. bastien0298

    Feko solver ERROR 20103

    Hi, I have problem when I try to solve my fekocad file. This happen ERROR 20103 in line 105 of the file @C:\Program Files\Altair\2018-edu\feko\FEKOenvironment.lua: Non-ASCII character detected! - Undefined behaviour! Someone already had this error in the past? thanks for reply!
  4. Hi, I am trying to export Y-parameters of an array which includes 16 elements, hence, 16 ports. I want to create a .y16p file but every time I try to export POSTFEKO crashes and is not responding. I know it is a lot of data to export, but is there any other way to get Zparameter data? Thanks in advance!
  5. pmgamache12

    Error # 157, 158 and 8012

    Hello I am trying to run an Optistruct optimisation but I get the following errors: *** ERROR # 157 *** Error opening the scratch file "./Analyse4_8584_s44.rs~" Fortran error code = 9 This may be caused by not having the access right to open the file, not enough memory left for the system routines, or some other system setup related reasons. This error was detected in subroutine opseqscr. *** ERROR # 158 *** Error encountered when accessing the scratch file. error from subroutine "xdslrs" Solver error no. = -702 This may be caused by insufficient disk space or some other system resource related limitations. This error was detected in subroutine bcsprefct. This error occurs in module "lstatdrv". *** FATAL ERROR # 8012 *** Data block kauspc is already inserted. * DATAMANAGER ERROR in subroutine "datami". PROGRAM STOPPED DUE TO ERROR. The constraint is a static stress called in the design variable. The objective is to minimize mass. The check only gives me such a warning: *** WARNING # 1848 Topology Optimization without Minimum Member Size Control activated. Using DTPL card, or DOPTPRM,MINDIM is recommended. Anybody has a clue of what is the problem? I'm a bit stuck here! Cheers
  6. I am trying to import a SolidWorks model from the 2018 version of SolidWorks to Altair SolidThinking Inspire 2018 and I keep getting a message saying unsupported file version or format. I have tried a model from SolidWorks 2016 and I am still getting the same error. I've attached a screenshot of the error message.
  7. Following the y-bracket tutorial leaves the optimisation hanging on 100% and analysis fails, saying contact support. The optimisation is definitely no longer doing anything because the process has no load on CPU. Please see attachments. Any help on this would be much appreciated. Best, Darren
  8. Aslan

    Error jacobian

    Hı everyone, I'm doing hex mesh. But I get a negative or zero jacobian error, I tried to remesh but ı cant because in the structure has holes. Can you help me?
  9. Hi all, I want to realize the model below in Transient Magnetic 2D. I_slot_1 and I_slot_2 are two points with induced current I_m * cos(wt), I_slot_3 and I_slot_4 with induced I_m * cos(wt - 2*pi/3) and I_slot_4 and I_slot_6 with induced current I_m * cos(wt + 2*pi/3). The pattern is repeated for the rest poles. I tried to do this with Point region of coil conductor region as below. But I can't slove it with the Failed execution message and I don't know where the problem is. Anyone know how to solve this problem? Thank you in advance. Kind regards, Chen
  10. Amelie Lemercier

    Error in solving process

    Hi ! I don't understand why at the second time iteration, the solver crash. I have change the solving options, it didn't change anything... Thanks for your help !
  11. When I tried to run one of the tutorials associated with the Modelica set that comes with Activate , I received an error message shown in the attached screenshot file. That message indicates "Modelica compiler requires Visual C++ compiler version >= 10". If I download and install the "Microsoft Visual C++ 2015 Redistributable Update 3 RC", do you expect that will resolve this error?
  12. etrud011

    Error Setting up framework

    Hello, When I try to open up hypermesh I get the following error: Error setting up framework: can't read "p_array(Model)":no such element in array while executing "raise $p_array($pagename)" (object"::HM_Framework::NotebookObj1" method "::HM_Framework::TGF_NotebookClass::ActivatePage" body line 3) invoked from within "$nb_obj ActivatePage $activeTabTitle" (procedure "p_InstallNotebookTabs" line 36) invoked from within "p_InstallNotebookTabs" (procedure "::HM_Framework::p_FinishInit" line 22) invoked from within "::HM_Framework::p_FinishInit" I uninstalled and then reinstalled Altair on my computer but the problem still persists. I also tried to remove the hmmenu.st files but that also did not work. What should I do to resolve this problem? Thank you -Eric
  13. Hello, On hyperform, I am having the following error while trying to launch a calculation using a blank that is solid and two tools that are just surfaces. I have defined that the blank is a solid and I have tried defining the contacts as well, but I am still getting this error. Can someone please explain why that is? Thank you
  14. suryanshu walvekar

    Error 1109 (No TH variable defined)

    Hi there, My simulation shows " Error in TH No restart file" How do I add this?
  15. Amelie Lemercier

    Problem to build faces

    Hi ! I have tried to build faces from the geometry menu and I have the error : Geometry is not correct and must be corrected. What can I do ? Why this error ? For information, I am trying to follow the tutorial of the example MagnetoThermal in 3D. Thanks in advance.
  16. Hi, I am getting this error: "The Hypermesh core has detected a non recoverable error" while deleting some surfaces from my model. I have also tried to delete the hypermesh settings from my documents and temp folders. Unfortunately it does not work. I would be glad for your help. Thanks in advance
  17. Aslan

    license error 9

    Hı , I dowload exe. folders from the site (connect.altair.com). But get a error in installation as a picture. Can you help me?
  18. gangstarr60

    RD-3560 Bottle Drop

    i did everything on tutorial but i have errors on bottle drop tutorial. bottle_0000.out
  19. I'm working on a model in Abaqus. For pre-processing I'm making use of Hypermesh. The abaqus file gets imported into hypermesh properly. But when I create new 2D elements, change material properties and component names and export it back, it fails to get imported properly in abaqus. All the components have been assigned with right properties. Is there something else I'm missing. Pls find the error while trying to import in Abaqus below: The model "C56_Atemp_2D_ELEMS" has been created. AbaqusException: in keyword *MATERIAL, file "C56_Atemp_2D_ELEMS.inp", line 52330: The keyword is misplaced. It can be suboption for the following keyword(s)/level(s): model in keyword *ELASTIC, file "C56_Atemp_2D_ELEMS.inp", line 52331: The keyword is misplaced. It can be suboption for the following keyword(s)/level(s): material in keyword *MATERIAL, file "C56_Atemp_2D_ELEMS.inp", line 52334: The keyword is misplaced. It can be suboption for the following keyword(s)/level(s): model in keyword *ELASTIC, file "C56_Atemp_2D_ELEMS.inp", line 52335: The keyword is misplaced. It can be suboption for the following keyword(s)/level(s): material in keyword *MATERIAL, file "C56_Atemp_2D_ELEMS.inp", line 52338: The keyword is misplaced. It can be suboption for the following keyword(s)/level(s): model in keyword *ELASTIC, file "C56_Atemp_2D_ELEMS.inp", line 52339: The keyword is misplaced. It can be suboption for the following keyword(s)/level(s): material in keyword *MATERIAL, file "C56_Atemp_2D_ELEMS.inp", line 52341: The keyword is misplaced. It can be suboption for the following keyword(s)/level(s): model in keyword *ELASTIC, file "C56_Atemp_2D_ELEMS.inp", line 52342: The keyword is misplaced. It can be suboption for the following keyword(s)/level(s): material in keyword *MATERIAL, file "C56_Atemp_2D_ELEMS.inp", line 52344: The keyword is misplaced. It can be suboption for the following keyword(s)/level(s): model in keyword *ELASTIC, file "C56_Atemp_2D_ELEMS.inp", line 52345: The keyword is misplaced. It can be suboption for the following keyword(s)/level(s): material in keyword *MATERIAL, file "C56_Atemp_2D_ELEMS.inp", line 52347: The keyword is misplaced. It can be suboption for the following keyword(s)/level(s): model in keyword *ELASTIC, file "C56_Atemp_2D_ELEMS.inp", line 52348: The keyword is misplaced. It can be suboption for the following keyword(s)/level(s): material
  20. Rajendra Prasad

    ACUSOLVE Error while solving Acuprep

    Hello, I am getting an error while Pre solving in Acusolve. I am getting error i.e. acuPrep: *** ASSERTION in Function <iopGetFileLineCnt> File <iopFile.c> Line <1368> acuPrep: *** unable to open file <MESH.DIR/MM_2.5L_BS6_TempEff_220518_T1.ExhtGas_ShapedTube_6.tet4.Face_ExhtGas4_Side0.tri3.ebc>; Too many open files acuRun: *** ERROR: error occurred executing acuPrep Can any one tell me why this error is coming & how to sovle it. I have attached .log & .inp file. Please find it. MM_2.5L_BS6_TempEff_220518_T1.1.Log MM_2.5L_BS6_TempEff_220518_T1.inp
  21. Can someone help me with the following error? *** INTERNAL PROGRAMMING ERROR *** in file "datasetFtoC.c", at location # 345. C1C2C.out
  22. rahulpillai

    Download error "edu2017_win64.exe"

    Hi. I am a university user and recently signed up for the student version of Altair hyper works. I received an email with links for download. However, when I click on the links, the download begins and goes towards completion (100%) but as soon as it hits 100%, the download fails with a 'Failed - Download Error'. This is for all links that were sent to me including Hyperworks student edition 2017, solidthinking student edition, Hyperworks student edition 2014 etc. Any way around this?
  23. Hello, I'm having troubles setting up a topography optimization using plies. The model is a heatshield with 3 different layers(thickness) and Im using PCOMPP card as property to them. I believe that the optimization settings are correct, because I had already used the same settings in a previous single layer model and it went ok. But when I try using stacked layers something goes wrong. Im getting the following error: *** ERROR # 79 *** DTPG data does not create any DVGRID data. There are no free referenced GRIDs. There may be no elements associated with the PSHELL data. LOAD or BOTH may be specified and all grids may be loaded. BC, SPC, or BOTH may be specified and all grids may be SPCed. Any thoughts?? If there is some paper relating modal+plies+optimization that can be provided I'll appreciate. Thanks in advance.
  24. Hi, I have this problem, but I do not know how to fix it. Error ID: 120 ** ERROR IN FUNCTION REFERENCE DESCRIPTION: - - CONCENTRATED LOADS WRONG REFERENCE TO FUNCTION ID=0
×